{"text_format":"1","workbook":"xlsx","n_sheets":9,"sheets":["Directory","Equipment_Inventory_List","Mainenance log","Charts","Annual Cost","Filter LIst","Service Interval","Equipment Category","Type of Service List"],"not_rendered":{"charts":3,"images":1,"macros":1,"external_links":0,"defined_names":14,"comments":0,"pivot_tables":3},"unopened":[],"bounds":{"document_bytes":16777216,"sheet_cells":100000,"rows_first":2000,"rows_last":500,"rows_between":2000,"halvings":0,"cell_chars":16384,"cell_head_chars":4096},"cells_cut":0,"cells_raw":0,"read":"part_too_large","date_system":"1900"}

{"sheet":"Directory","index":0,"n_rows":15,"n_cols":13,"rows_kept":15,"cut":false,"hidden":false,"merged":[[12,1,12,3],[13,1,13,3],[14,1,14,3],[7,1,7,3],[8,1,8,3],[9,1,9,3],[10,1,10,3],[11,1,11,3]]}
[]
[]
[]
[]
[]
[null,"Directory",null,null,null,null,null,"User Notes",null,null,null,null,"Enabled"]
[null,null,null,null,null,null,null,null,null,null,null,null,"Disabled"]
[null,"•  Equipment Inventory List",null,null,null,null,null,"Value",null,"Requires user input for best cost estimation."]
[null,"•  Maintenance Log"]
[null,"•  Cost Charts",null,null,null,null,null,null,null,"Indicates values are currently not included in cost estimation."]
{"$rows_left_out":6}
{"sheet":"Equipment_Inventory_List","index":1,"n_rows":102,"n_cols":15,"rows_kept":102,"cut":false,"hidden":false,"merged":[]}
[]
["#","Name of Equipment","Manufacturer","Model","Color","Serial Number","Production Year","Date of Purchase","Purchase Price","Equipment Category","Equipment Type","Intial Hours","Last Recorded Hours","Last Service Date","Location"]
[1,"Example Baler","Vermeer",605,"Yellow",null,null,null,null,"HARVESTING, FORAGE","Large round baler",null,{"$f":"IF(OR(ISBLANK(B3),MAX(IF(MainName=Equipment_Inventory_List!B3,Hours))=0),\"\",MAX(IF(MainName=Equipment_Inventory_List!B3,Hours)))","v":""},{"$f":"IF(OR(ISBLANK(B3),MAX(IF(MainName=Equipment_Inventory_List!B5,JJdate))=0),\"\",MAX(IF(MainName=Equipment_Inventory_List!B5,JJdate)))","v":""}]
[2,"Example disc cutter","New Holland",462,"Red",null,null,null,null,"HARVESTING, FORAGE","Mower (rotary)",null,{"$f":"IF(OR(ISBLANK(B4),MAX(IF(MainName=Equipment_Inventory_List!B4,Hours))=0),\"\",MAX(IF(MainName=Equipment_Inventory_List!B4,Hours)))","v":""},{"$f":"IF(OR(ISBLANK(B4),MAX(IF(MainName=Equipment_Inventory_List!B6,JJdate))=0),\"\",MAX(IF(MainName=Equipment_Inventory_List!B6,JJdate)))","v":"2023-01-01"}]
[3,"Example haybine","New Holland",467,"Red",null,null,null,null,"HARVESTING, FORAGE","Mower-conditioner",null,{"$f":"IF(OR(ISBLANK(B5),MAX(IF(MainName=Equipment_Inventory_List!B5,Hours))=0),\"\",MAX(IF(MainName=Equipment_Inventory_List!B5,Hours)))","v":""},{"$f":"IF(OR(ISBLANK(B5),MAX(IF(MainName=Equipment_Inventory_List!B7,JJdate))=0),\"\",MAX(IF(MainName=Equipment_Inventory_List!B7,JJdate)))","v":""}]
[4,"Example discbine","New Holland",1411,"Red",null,null,null,null,"HARVESTING, FORAGE","Mower-conditioner (rotary)",null,{"$f":"IF(OR(ISBLANK(B6),MAX(IF(MainName=Equipment_Inventory_List!B6,Hours))=0),\"\",MAX(IF(MainName=Equipment_Inventory_List!B6,Hours)))","v":""},{"$f":"IF(OR(ISBLANK(B6),MAX(IF(MainName=Equipment_Inventory_List!B8,JJdate))=0),\"\",MAX(IF(MainName=Equipment_Inventory_List!B8,JJdate)))","v":""}]
[5,"Example square baler","Case",200,null,null,null,null,null,"HARVESTING, FORAGE","Rectangular baler",null,{"$f":"IF(OR(ISBLANK(B7),MAX(IF(MainName=Equipment_Inventory_List!B7,Hours))=0),\"\",MAX(IF(MainName=Equipment_Inventory_List!B7,Hours)))","v":""},{"$f":"IF(OR(ISBLANK(B7),MAX(IF(MainName=Equipment_Inventory_List!B9,JJdate))=0),\"\",MAX(IF(MainName=Equipment_Inventory_List!B9,JJdate)))","v":""}]
[6,"Example Bar Rake","John Deere",null,"Green",null,null,null,null,"HARVESTING, FORAGE","Side delivery rake",null,{"$f":"IF(OR(ISBLANK(B8),MAX(IF(MainName=Equipment_Inventory_List!B8,Hours))=0),\"\",MAX(IF(MainName=Equipment_Inventory_List!B8,Hours)))","v":""},{"$f":"IF(OR(ISBLANK(B8),MAX(IF(MainName=Equipment_Inventory_List!B10,JJdate))=0),\"\",MAX(IF(MainName=Equipment_Inventory_List!B10,JJdate)))","v":"2023-02-04"}]
[7,"Example V Rake",null,null,"green",null,null,null,null,"HARVESTING, FORAGE","V-rake-10 wheel",null,{"$f":"IF(OR(ISBLANK(B9),MAX(IF(MainName=Equipment_Inventory_List!B9,Hours))=0),\"\",MAX(IF(MainName=Equipment_Inventory_List!B9,Hours)))","v":""},{"$f":"IF(OR(ISBLANK(B9),MAX(IF(MainName=Equipment_Inventory_List!B11,JJdate))=0),\"\",MAX(IF(MainName=Equipment_Inventory_List!B11,JJdate)))","v":""}]
[8,"Example Small Spreader",null,null,null,null,null,null,null,"Manure Management","Ground Drive",null,{"$f":"IF(OR(ISBLANK(B10),MAX(IF(MainName=Equipment_Inventory_List!B10,Hours))=0),\"\",MAX(IF(MainName=Equipment_Inventory_List!B10,Hours)))","v":8},{"$f":"IF(OR(ISBLANK(B10),MAX(IF(MainName=Equipment_Inventory_List!B14,JJdate))=0),\"\",MAX(IF(MainName=Equipment_Inventory_List!B14,JJdate)))","v":"2023-02-04"}]
{"$rows_left_out":93}
{"sheet":"Mainenance log","index":2,"n_rows":0,"n_cols":0,"rows_kept":0,"cut":false,"hidden":false,"merged":[],"read":"part_too_large"}

{"sheet":"Charts","index":3,"n_rows":44,"n_cols":8,"rows_kept":44,"cut":false,"hidden":false,"merged":[]}
[]
[]
[]
[]
[null,null,null,"Sum of Cost","Column Labels"]
[null,null,null,"Row Labels","Basic Service","Repairs","(blank)","Grand Total"]
[null,null,null,"(blank)"]
[null,null,null,"Example Tractor 2",50,100,null,150]
[null,null,null,"Example Tractor 1",50,225,null,275]
[null,null,null,"Example Tractor 3",null,125,null,125]
{"$rows_left_out":35}
{"sheet":"Annual Cost","index":4,"n_rows":5,"n_cols":8,"rows_kept":5,"cut":false,"hidden":false,"merged":[]}
[]
[]
[]
[null,"Year","Name of Equipment ","Annual Cost","Hydraulic Oil","Engine Oil","Coolant","Gear Oil"]
[null,2022,"Example Tractor 2",{"$f":"SUMIFS('Mainenance log'!I3:I1048576,'Mainenance log'!B3:B1048576,C5,'Mainenance log'!L3:L1048576,B5)","v":110},{"$f":"SUMIFS('Mainenance log'!$G$3:$G$1048576,'Mainenance log'!$B$3:$B$1048576,'Annual Cost'!$C$5,'Mainenance log'!$E$3:$E$1048576,'Type of Service List'!$B15,'Mainenance log'!$L$3:$L$1048576,'Annual Cost'!$B$5)","v":1},{"$f":"SUMIFS('Mainenance log'!$G$3:$G$1048576,'Mainenance log'!$B$3:$B$1048576,'Annual Cost'!$C$5,'Mainenance log'!$E$3:$E$1048576,'Type of Service List'!$B9,'Mainenance log'!$L$3:$L$1048576,'Annual Cost'!$B$5)+SUMIFS('Mainenance log'!$G$3:$G$1048576,'Mainenance log'!$B$3:$B$1048576,'Annual Cost'!$C$5,'Mainenance log'!$E$3:$E$1048576,'Type of Service List'!$B10,'Mainenance log'!$L$3:$L$1048576,'Annual Cost'!$B$5)","v":0},{"$f":"SUMIFS('Mainenance log'!$G$3:$G$1048576,'Mainenance log'!$B$3:$B$1048576,'Annual Cost'!$C$5,'Mainenance log'!$E$3:$E$1048576,'Type of Service List'!$B7,'Mainenance log'!$L$3:$L$1048576,'Annual Cost'!$B$5)+SUMIFS('Mainenance log'!$G$3:$G$1048576,'Mainenance log'!$B$3:$B$1048576,'Annual Cost'!$C$5,'Mainenance log'!$E$3:$E$1048576,'Type of Service List'!$B8,'Mainenance log'!$L$3:$L$1048576,'Annual Cost'!$B$5)","v":0},{"$f":"SUMIFS('Mainenance log'!$G$3:$G$1048576,'Mainenance log'!$B$3:$B$1048576,'Annual Cost'!$C$5,'Mainenance log'!$E$3:$E$1048576,'Type of Service List'!$B12,'Mainenance log'!$L$3:$L$1048576,'Annual Cost'!$B$5)","v":0}]

{"sheet":"Filter LIst","index":5,"n_rows":104,"n_cols":13,"rows_kept":104,"cut":false,"hidden":false,"merged":[]}
[]
[]
[]
[null,"Equipment Name","Engine Oil ","Hydraulic Oil","Gear Oil","Steer Fluid","Brake Fluid","Oil Filter 1","Fuel Filter","Air Filter","Hydraulic Filter","Oil Filter Cross Reference","Fuel Filter Cross Reference"]
[1,"Example Tractor 1","15W-40","iso-46","80-90","ISO-46",null,"Wix 1415"]
[2]
[3]
[4]
[5]
[6]
{"$rows_left_out":95}
{"sheet":"Service Interval","index":6,"n_rows":105,"n_cols":21,"rows_kept":105,"cut":false,"hidden":false,"merged":[[3,3,3,10],[3,13,3,20],[2,11,2,20]]}
[]
[]
[null,null,null,null,null,null,null,null,null,null,null,"Flags for Service Required"]
[null,null,null,"Service Interval (Hours)",null,null,null,null,null,null,null,null,null,"Last Recorded Service Hours"]
[null,null,"Name of Equipment","Air filter","Coolant","Engine Oil Filter","Fuel Filter","Grease","Gear Oil","Hydraulic Filter","Transmission filter","Last Recorded Hours","Current  hours","Air filter","Coolant","Engine Oil Filter","Fuel Filter","Grease","Gear Oil","Hydraulic Filter","Transmission Filter"]
[null,1,"Example Tractor 2",200,600,200,600,10,null,200,null,{"$f":"IF(ISBLANK(C6),\"\",_xlfn.MAXIFS(Hours,MainName,C6))","v":6680},6800,{"$f":"IF(OR(ISBLANK(C6),ISBLANK(D6)),\"\",_xlfn.MAXIFS('Mainenance log'!$H$3:$H$1048576,'Mainenance log'!$B$3:$B$1048576,'Service Interval'!$C6,'Mainenance log'!$E$3:$E$1048576,'Type of Service List'!$B$5))","v":0},{"$f":"IF(OR(ISBLANK(C6),ISBLANK(E6)),\"\",_xlfn.MAXIFS('Mainenance log'!$H$3:$H$1048576,'Mainenance log'!$B$3:$B$1048576,'Service Interval'!$C6,'Mainenance log'!$E$3:$E$1048576,'Type of Service List'!$B$8))","v":0},{"$f":"IF(OR(ISBLANK(C6),ISBLANK(F6)),\"\",_xlfn.MAXIFS('Mainenance log'!$H$3:$H$1048576,'Mainenance log'!$B$3:$B$1048576,'Service Interval'!$C6,'Mainenance log'!$E$3:$E$1048576,'Type of Service List'!$B$10))","v":0},{"$f":"IF(OR(ISBLANK(C6),ISBLANK(G6)),\"\",_xlfn.MAXIFS('Mainenance log'!$H$3:$H$1048576,'Mainenance log'!$B$3:$B$1048576,'Service Interval'!$C6,'Mainenance log'!$E$3:$E$1048576,'Type of Service List'!$B$11))","v":0},{"$f":"IF(OR(ISBLANK(C6),ISBLANK(H6)),\"\",_xlfn.MAXIFS('Mainenance log'!$H$3:$H$1048576,'Mainenance log'!$B$3:$B$1048576,'Service Interval'!$C6,'Mainenance log'!$E$3:$E$1048576,'Type of Service List'!$B$13))","v":0},{"$f":"IF(OR(ISBLANK(C6),ISBLANK(I6)),\"\",_xlfn.MAXIFS('Mainenance log'!$H$3:$H$1048576,'Mainenance log'!$B$3:$B$1048576,'Service Interval'!$C6,'Mainenance log'!$E$3:$E$1048576,'Type of Service List'!$B$12))","v":""},{"$f":"IF(OR(ISBLANK(C6),ISBLANK(J6)),\"\",_xlfn.MAXIFS('Mainenance log'!$H$3:$H$1048576,'Mainenance log'!$B$3:$B$1048576,'Service Interval'!$C6,'Mainenance log'!$E$3:$E$1048576,'Type of Service List'!$B$14))","v":0},{"$f":"IF(OR(ISBLANK(C6),ISBLANK(K6)),\"\",_xlfn.MAXIFS('Mainenance log'!$H$3:$H$1048576,'Mainenance log'!$B$3:$B$1048576,'Service Interval'!$C6,'Mainenance log'!$E$3:$E$1048576,'Type of Service List'!$B$16))","v":""}]
[null,2,"Example Tractor 3",200,null,200,400,10,null,200,null,5500,6000,{"$f":"IF(OR(ISBLANK(C7),ISBLANK(D7)),\"\",_xlfn.MAXIFS('Mainenance log'!$H$3:$H$1048576,'Mainenance log'!$B$3:$B$1048576,'Service Interval'!$C7,'Mainenance log'!$E$3:$E$1048576,'Type of Service List'!$B$5))","v":0},{"$f":"IF(OR(ISBLANK(C7),ISBLANK(E7)),\"\",_xlfn.MAXIFS('Mainenance log'!$H$3:$H$1048576,'Mainenance log'!$B$3:$B$1048576,'Service Interval'!$C7,'Mainenance log'!$E$3:$E$1048576,'Type of Service List'!$B$8))","v":""},{"$f":"IF(OR(ISBLANK(C7),ISBLANK(F7)),\"\",_xlfn.MAXIFS('Mainenance log'!$H$3:$H$1048576,'Mainenance log'!$B$3:$B$1048576,'Service Interval'!$C7,'Mainenance log'!$E$3:$E$1048576,'Type of Service List'!$B$10))","v":0},{"$f":"IF(OR(ISBLANK(C7),ISBLANK(G7)),\"\",_xlfn.MAXIFS('Mainenance log'!$H$3:$H$1048576,'Mainenance log'!$B$3:$B$1048576,'Service Interval'!$C7,'Mainenance log'!$E$3:$E$1048576,'Type of Service List'!$B$11))","v":0},{"$f":"IF(OR(ISBLANK(C7),ISBLANK(H7)),\"\",_xlfn.MAXIFS('Mainenance log'!$H$3:$H$1048576,'Mainenance log'!$B$3:$B$1048576,'Service Interval'!$C7,'Mainenance log'!$E$3:$E$1048576,'Type of Service List'!$B$13))","v":0},{"$f":"IF(OR(ISBLANK(C7),ISBLANK(I7)),\"\",_xlfn.MAXIFS('Mainenance log'!$H$3:$H$1048576,'Mainenance log'!$B$3:$B$1048576,'Service Interval'!$C7,'Mainenance log'!$E$3:$E$1048576,'Type of Service List'!$B$12))","v":""},{"$f":"IF(OR(ISBLANK(C7),ISBLANK(J7)),\"\",_xlfn.MAXIFS('Mainenance log'!$H$3:$H$1048576,'Mainenance log'!$B$3:$B$1048576,'Service Interval'!$C7,'Mainenance log'!$E$3:$E$1048576,'Type of Service List'!$B$14))","v":0},{"$f":"IF(OR(ISBLANK(C7),ISBLANK(K7)),\"\",_xlfn.MAXIFS('Mainenance log'!$H$3:$H$1048576,'Mainenance log'!$B$3:$B$1048576,'Service Interval'!$C7,'Mainenance log'!$E$3:$E$1048576,'Type of Service List'!$B$16))","v":""}]
[null,3,"Example Tractor 1",200,600,200,400,10,20,200,400,4500,null,{"$f":"IF(OR(ISBLANK(C8),ISBLANK(D8)),\"\",_xlfn.MAXIFS('Mainenance log'!$H$3:$H$1048576,'Mainenance log'!$B$3:$B$1048576,'Service Interval'!$C8,'Mainenance log'!$E$3:$E$1048576,'Type of Service List'!$B$5))","v":0},{"$f":"IF(OR(ISBLANK(C8),ISBLANK(E8)),\"\",_xlfn.MAXIFS('Mainenance log'!$H$3:$H$1048576,'Mainenance log'!$B$3:$B$1048576,'Service Interval'!$C8,'Mainenance log'!$E$3:$E$1048576,'Type of Service List'!$B$8))","v":0},{"$f":"IF(OR(ISBLANK(C8),ISBLANK(F8)),\"\",_xlfn.MAXIFS('Mainenance log'!$H$3:$H$1048576,'Mainenance log'!$B$3:$B$1048576,'Service Interval'!$C8,'Mainenance log'!$E$3:$E$1048576,'Type of Service List'!$B$10))","v":0},{"$f":"IF(OR(ISBLANK(C8),ISBLANK(G8)),\"\",_xlfn.MAXIFS('Mainenance log'!$H$3:$H$1048576,'Mainenance log'!$B$3:$B$1048576,'Service Interval'!$C8,'Mainenance log'!$E$3:$E$1048576,'Type of Service List'!$B$11))","v":0},{"$f":"IF(OR(ISBLANK(C8),ISBLANK(H8)),\"\",_xlfn.MAXIFS('Mainenance log'!$H$3:$H$1048576,'Mainenance log'!$B$3:$B$1048576,'Service Interval'!$C8,'Mainenance log'!$E$3:$E$1048576,'Type of Service List'!$B$13))","v":0},{"$f":"IF(OR(ISBLANK(C8),ISBLANK(I8)),\"\",_xlfn.MAXIFS('Mainenance log'!$H$3:$H$1048576,'Mainenance log'!$B$3:$B$1048576,'Service Interval'!$C8,'Mainenance log'!$E$3:$E$1048576,'Type of Service List'!$B$12))","v":0},{"$f":"IF(OR(ISBLANK(C8),ISBLANK(J8)),\"\",_xlfn.MAXIFS('Mainenance log'!$H$3:$H$1048576,'Mainenance log'!$B$3:$B$1048576,'Service Interval'!$C8,'Mainenance log'!$E$3:$E$1048576,'Type of Service List'!$B$14))","v":4500},{"$f":"IF(OR(ISBLANK(C8),ISBLANK(K8)),\"\",_xlfn.MAXIFS('Mainenance log'!$H$3:$H$1048576,'Mainenance log'!$B$3:$B$1048576,'Service Interval'!$C8,'Mainenance log'!$E$3:$E$1048576,'Type of Service List'!$B$16))","v":0}]
[null,4,null,null,null,null,null,null,null,null,null,"",null,{"$f":"IF(OR(ISBLANK(C9),ISBLANK(D9)),\"\",_xlfn.MAXIFS('Mainenance log'!$H$3:$H$1048576,'Mainenance log'!$B$3:$B$1048576,'Service Interval'!$C9,'Mainenance log'!$E$3:$E$1048576,'Type of Service List'!$B$5))","v":""},{"$f":"IF(OR(ISBLANK(C9),ISBLANK(E9)),\"\",_xlfn.MAXIFS('Mainenance log'!$H$3:$H$1048576,'Mainenance log'!$B$3:$B$1048576,'Service Interval'!$C9,'Mainenance log'!$E$3:$E$1048576,'Type of Service List'!$B$8))","v":""},{"$f":"IF(OR(ISBLANK(C9),ISBLANK(F9)),\"\",_xlfn.MAXIFS('Mainenance log'!$H$3:$H$1048576,'Mainenance log'!$B$3:$B$1048576,'Service Interval'!$C9,'Mainenance log'!$E$3:$E$1048576,'Type of Service List'!$B$10))","v":""},{"$f":"IF(OR(ISBLANK(C9),ISBLANK(G9)),\"\",_xlfn.MAXIFS('Mainenance log'!$H$3:$H$1048576,'Mainenance log'!$B$3:$B$1048576,'Service Interval'!$C9,'Mainenance log'!$E$3:$E$1048576,'Type of Service List'!$B$11))","v":""},{"$f":"IF(OR(ISBLANK(C9),ISBLANK(H9)),\"\",_xlfn.MAXIFS('Mainenance log'!$H$3:$H$1048576,'Mainenance log'!$B$3:$B$1048576,'Service Interval'!$C9,'Mainenance log'!$E$3:$E$1048576,'Type of Service List'!$B$13))","v":""},{"$f":"IF(OR(ISBLANK(C9),ISBLANK(I9)),\"\",_xlfn.MAXIFS('Mainenance log'!$H$3:$H$1048576,'Mainenance log'!$B$3:$B$1048576,'Service Interval'!$C9,'Mainenance log'!$E$3:$E$1048576,'Type of Service List'!$B$12))","v":""},{"$f":"IF(OR(ISBLANK(C9),ISBLANK(J9)),\"\",_xlfn.MAXIFS('Mainenance log'!$H$3:$H$1048576,'Mainenance log'!$B$3:$B$1048576,'Service Interval'!$C9,'Mainenance log'!$E$3:$E$1048576,'Type of Service List'!$B$14))","v":""},{"$f":"IF(OR(ISBLANK(C9),ISBLANK(K9)),\"\",_xlfn.MAXIFS('Mainenance log'!$H$3:$H$1048576,'Mainenance log'!$B$3:$B$1048576,'Service Interval'!$C9,'Mainenance log'!$E$3:$E$1048576,'Type of Service List'!$B$16))","v":""}]
[null,5,null,null,null,null,null,null,null,null,null,"",null,{"$f":"IF(OR(ISBLANK(C10),ISBLANK(D10)),\"\",_xlfn.MAXIFS('Mainenance log'!$H$3:$H$1048576,'Mainenance log'!$B$3:$B$1048576,'Service Interval'!$C10,'Mainenance log'!$E$3:$E$1048576,'Type of Service List'!$B$5))","v":""},{"$f":"IF(OR(ISBLANK(C10),ISBLANK(E10)),\"\",_xlfn.MAXIFS('Mainenance log'!$H$3:$H$1048576,'Mainenance log'!$B$3:$B$1048576,'Service Interval'!$C10,'Mainenance log'!$E$3:$E$1048576,'Type of Service List'!$B$8))","v":""},{"$f":"IF(OR(ISBLANK(C10),ISBLANK(F10)),\"\",_xlfn.MAXIFS('Mainenance log'!$H$3:$H$1048576,'Mainenance log'!$B$3:$B$1048576,'Service Interval'!$C10,'Mainenance log'!$E$3:$E$1048576,'Type of Service List'!$B$10))","v":""},{"$f":"IF(OR(ISBLANK(C10),ISBLANK(G10)),\"\",_xlfn.MAXIFS('Mainenance log'!$H$3:$H$1048576,'Mainenance log'!$B$3:$B$1048576,'Service Interval'!$C10,'Mainenance log'!$E$3:$E$1048576,'Type of Service List'!$B$11))","v":""},{"$f":"IF(OR(ISBLANK(C10),ISBLANK(H10)),\"\",_xlfn.MAXIFS('Mainenance log'!$H$3:$H$1048576,'Mainenance log'!$B$3:$B$1048576,'Service Interval'!$C10,'Mainenance log'!$E$3:$E$1048576,'Type of Service List'!$B$13))","v":""},{"$f":"IF(OR(ISBLANK(C10),ISBLANK(I10)),\"\",_xlfn.MAXIFS('Mainenance log'!$H$3:$H$1048576,'Mainenance log'!$B$3:$B$1048576,'Service Interval'!$C10,'Mainenance log'!$E$3:$E$1048576,'Type of Service List'!$B$12))","v":""},{"$f":"IF(OR(ISBLANK(C10),ISBLANK(J10)),\"\",_xlfn.MAXIFS('Mainenance log'!$H$3:$H$1048576,'Mainenance log'!$B$3:$B$1048576,'Service Interval'!$C10,'Mainenance log'!$E$3:$E$1048576,'Type of Service List'!$B$14))","v":""},{"$f":"IF(OR(ISBLANK(C10),ISBLANK(K10)),\"\",_xlfn.MAXIFS('Mainenance log'!$H$3:$H$1048576,'Mainenance log'!$B$3:$B$1048576,'Service Interval'!$C10,'Mainenance log'!$E$3:$E$1048576,'Type of Service List'!$B$16))","v":""}]
{"$rows_left_out":96}
{"sheet":"Equipment Category","index":7,"n_rows":14,"n_cols":16,"rows_kept":14,"cut":false,"hidden":false,"merged":[]}
[]
[]
[]
[null,"HARVESTING, CROP","HARVESTING, CROP SP","HARVESTING, FORAGE","HARVESTING, FORAGE SP","Manure Management","MISCELLANEOUS","PLANTERS","TILLAGE","TRACTORS 20-80 hp","TRACTORS 80-149 hp","TRACTORS 150+ hp","Trailer/wagon","Truck","Add Category","Add Category2"]
[null,"Corn picker sheller","SP Combine","Forage harvester","SP Forage harvester","Ground Drive","Bean puller/windrower","Grain drill","Field Cultivator","2WD <80hp","2WD <150hp","2WD 150+ hp","Flatbed","Old"]
[null,"Potato harvester","SP Cotton picker","Large rectangular baler","SP Windrower","Horizontal Beaters","Beet topper/chopper","Roller-packer","Heavy-duty disk","4WD & crawler <80 hp","4WD & crawler <150 hp","4WD & crawler 150+ hp","Cattle","good"]
[null,"PT Combine",null,"Large round baler",null,"Side Discharge","Boom-type sprayer","Row crop planter","Moldboard plow",null,null,null,"Dump","semi"]
[null,"Sugar beet harvester",null,"Mower",null,null,"Fertilizer spreader",null,"Mulcher-packer",null,null,null,"Tilt"]
[null,"harvester",null,"Mower (rotary)",null,null,null,null,"Rotary hoe",null,null,null,"Equipment"]
[null,null,null,"Mower-conditioner",null,null,null,null,"Rotary tiller",null,null,null,"Car/Auto"]
{"$rows_left_out":5}
{"sheet":"Type of Service List","index":8,"n_rows":42,"n_cols":3,"rows_kept":42,"cut":false,"hidden":false,"merged":[]}
[]
[]
[]
[null,"Basic Service","Repairs"]
[null,"Air Filter","A/C System"]
[null,"Brake Fluid","Battery"]
[null,"Coolant Addition","Belts"]
[null,"Coolant Change","Body"]
[null,"Engine Oil Addition","Brake Fluid"]
[null,"Engine Oil/Filter Change","Brake left"]
{"$rows_left_out":32}